Update Changelog

5 jobs for devel in 22 minutes and 39 seconds (queued for 2 seconds)
Status Name Job ID Coverage
  Jalhyd
passed jalhyd #112748

00:02:15

 
  Install
passed install #112749

00:03:23

 
  Test
failed test #112750

00:17:01

 
  Build
skipped build #112751
 
  Releases Nightly
skipped releases-nightly #112752
 
Name Stage Failure
failed
test Test
npm ERR! fr.irstea.cassiopee@4.11.1 e2e: `npm run preprocess && node scripts/check-translations.js && npm run ng -- e2e --suite=regular --webdriver-update=false`
npm ERR! Exit status 1
npm ERR!
npm ERR! Failed at the fr.irstea.cassiopee@4.11.1 e2e script.
npm ERR! This is probably not a problem with npm. There is likely additional logging output above.

npm ERR! A complete log of this run can be found in:
npm ERR! /root/.npm/_logs/2020-09-08T03_42_05_122Z-debug.log
ERROR: Job failed: exit code 1