Update README

5 jobs for master in 16 minutes and 12 seconds (queued for 1 second)
Status Name Job ID Coverage
  Jalhyd
passed jalhyd #65095

00:02:06

 
  Install
passed install #65096

00:03:14

 
  Test
failed test #65097

00:10:51

 
  Build
skipped build #65098
 
  Release Linux
skipped release-linux #65099
 
Name Stage Failure
failed
test Test
npm ERR! fr.irstea.cassiopee@4.8.0 e2e: `npm run preprocess && npm run ng -- e2e`
npm ERR! Exit status 1
npm ERR!
npm ERR! Failed at the fr.irstea.cassiopee@4.8.0 e2e script.
npm ERR! This is probably not a problem with npm. There is likely additional logging output above.

npm ERR! A complete log of this run can be found in:
npm ERR! /root/.npm/_logs/2019-12-09T06_35_43_667Z-debug.log
ERROR: Job failed: exit code 1